CE9805: Java Synchronization Failed one or more repositories could not found Error

FAILURE: Build failed with an exception. * What went wrong:A problem occurred configuring root project 'temp'.> Could not resolve all files for configuration ':classpath'.   > Could not resolve org.cyclonedx:cyclonedx-gradle-plugin:1.8.1.     Required by:         project : > org.cyclonedx.bom:org.cyclonedx.bom.gradle.plugin:1.8.1      > Could not resolve org.cyclonedx:cyclonedx-gradle-plugin:1.8.1.         > Could not get resource 'https://plugins.gradle.org/m2/org/cyclonedx/cyclonedx-gradle-plugin/1.8.1/cyclonedx-gradle-plugin-1.8.1.pom'.            > Could not GET 'https://plugins-artifacts.gradle.org/org.cyclonedx/cyclonedx-gradle-plugin/1.8.1/df0b3ac341d1d5755dac5fa5458dad7694cbb8d62fb6414a8057a3fad270ff1b/cyclonedx-gradle-plugin-1.8.1.pom'.               > PKIX path building failed: sun.security.provider.certpath.SunCertPathBuilderException: unable to find valid certification path to requested target * Try:> Run with --stacktrace option to get the stack trace.> Run with --info or --debug option to get more log output.> Run with --scan to get full insights. * Get more help at https://help.gradle.org BUILD FAILED in 2s
1 answers

Hi Ratnesh,


I answered a question with the same problem here:



I hope that the answer found there is helpful to you, best regards!